linux mint 17编译android 2.3.1错误记录

有转载这里的也有添加的。

################# Fix 1 ##########################

Error:

frameworks/base/include/utils/KeyedVector.h:193:31: note: declarations in dependent base ‘android::KeyedVector<android::String8, android::sp<AaptDir> >’ are not found by unqualified lookup

frameworks/base/include/utils/KeyedVector.h:193:31: note: use ‘this->indexOfKey’ instead

make: *** [out/host/linux-x86/obj/EXECUTABLES/aapt_intermediates/AaptAssets.o] Error 1

Fix:
vi frameworks/base/tools/aapt/Android.mk

Add ‘-fpermissive‘ to line 31:
LOCAL_CFLAGS += -Wno-format-y2k -fpermissive

################## Fix 2 ##########################

Error:

frameworks/base/include/utils/KeyedVector.h:193:31: error: ‘indexOfKey’ was not declared in this scope, and no declarations were found by argument-dependent lookup at the point of instantiation [-fpermissive]

frameworks/base/include/utils/KeyedVector.h:193:31: note: declarations in dependent base ‘android::KeyedVector<android::String8, android::wp<android::AssetManager::SharedZip> >’ are not found by unqualified lookup

frameworks/base/include/utils/KeyedVector.h:193:31: note: use ‘this->indexOfKey’ instead

make: *** [out/host/linux-x86/obj/STATIC_LIBRARIES/libutils_intermediates/AssetManager.o] Error 1

Fix:
vi frameworks/base/libs/utils/Android.mk

Add ‘-fpermissive‘ to line 64:
LOCAL_CFLAGS += -DLIBUTILS_NATIVE=1 $(TOOL_CFLAGS) -fpermissive

################## Fix 3 ##########################

Error:
external/srec/tools/thirdparty/OpenFst/fst/lib/cache.h:136:11: note: use ‘this->SetState’ instead
make: *** [out/host/linux-x86/obj/EXECUTABLES/grxmlcompile_intermediates/grxmlcompile.o] Error 1

Fix:
cd external/srec
wget "https://github.com/CyanogenMod/android_external_srec/commit/4d7ae7b79eda47e489669fbbe1f91ec501d42fb2.diff"
patch -p1 < 4d7ae7b79eda47e489669fbbe1f91ec501d42fb2.diff
rm -f 4d7ae7b79eda47e489669fbbe1f91ec501d42fb2.diff
cd ../..

################## Fix 3.1 ##########################

Error:
host C++: obbtool <= frameworks/base/tools/obbtool/Main.cpp
host C: parseStringTest <= external/srec/tools/parseStringTest/parseStringTest.c
<命令行>:0:0: 错误: “_FORTIFY_SOURCE”重定义 [-Werror]
frameworks/base/tools/obbtool/Main.cpp:1:0: 附注: 这是先前定义的位置

make: *** [out/host/linux-x86/obj/EXECUTABLES/obbtool_intermediates/Main.o] 错误 1

Fix:

vi build/core/combo/HOST_linux-x86.mk  line56
Add  -U_FORTIFY_SOURCE

HOST_GLOBAL_CFLAGS += -U_FORTIFY_SOURCE -D_FORTIFY_SOURCE=0

################## Fix 4 ##########################

Error:
development/tools/emulator/opengl/host/tools/emugen/main.cpp:79:9: error: ‘optind’ was not declared in this scope
development/tools/emulator/opengl/host/tools/emugen/main.cpp:92:45: error: ‘optind’ was not declared in this scope
make: *** [out/host/linux-x86/obj/EXECUTABLES/emugen_intermediates/main.o] Error 1

Fix:
vi development/tools/emulator/opengl/host/tools/emugen/main.cpp

Add ‘#include <getopt.h>‘ to list of includes:
#include <getopt.h>

################## Fix 5 ##########################

Error:
host C++: liboprofile_pp <= external/oprofile/libpp/arrange_profiles.cpp
In file included from external/oprofile/libpp/arrange_profiles.cpp:24:0:
external/oprofile/libpp/format_output.h:94:22: error: reference ‘counts’ cannot be declared ‘mutable’ [-fpermissive]
make: *** [out/host/linux-x86/obj/STATIC_LIBRARIES/liboprofile_pp_intermediates/arrange_profiles.o] Error 1

Fix:
vi external/oprofile/libpp/format_output.h

Remove ‘mutable‘ from ‘mutable counts_t & counts;‘ on line 94:
counts_t & counts;

################## Fix 6 ##########################

Error:
development/tools/emulator/opengl/shared/OpenglCodecCommon/GLSharedGroup.cpp:345:65:   required from here

frameworks/base/include/utils/KeyedVector.h:193:31: error: ‘indexOfKey’ was not declared in this scope, and no declarations were found by argument-dependent lookup at the point of instantiation [-fpermissive]

frameworks/base/include/utils/KeyedVector.h:193:31: note: declarations in dependent base ‘android::KeyedVector<unsigned int, ShaderData*>’ are not found by unqualified lookup

frameworks/base/include/utils/KeyedVector.h:193:31: note: use ‘this->indexOfKey’ instead

make: *** [out/host/linux-x86/obj/STATIC_LIBRARIES/libOpenglCodecCommon_intermediates/GLSharedGroup.o] Error 1

Fix:
vi development/tools/emulator/opengl/Android.mk

Add ‘-fpermissive‘ to line 25:
EMUGL_COMMON_CFLAGS := -DWITH_GLES2 -fpermissive

################## Fix 7 ##########################

Error:
/usr/bin/ld: note: ‘XInitThreads‘ is defined in DSO /lib/libX11.so.6 so try adding it to the linker command line
/lib/libX11.so.6: could not read symbols: Invalid operation
collect2: error: ld returned 1 exit status
make: *** [out/host/linux-x86/obj/EXECUTABLES/emulator_renderer_intermediates/emulator_renderer] Error 1

Fix:
vi development/tools/emulator/opengl/host/renderer/Android.mk

Add new entry ‘LOCAL_LDLIBS += -lX11‘ after line 6 as shown:
LOCAL_SRC_FILES := main.cpp
LOCAL_CFLAGS    += -O0 -g
LOCAL_LDLIBS += -lX11

#ifeq ($(HOST_OS),windows)
#LOCAL_LDLIBS += -lws2_32

################## Fix 8 ##########################

Error:
external/llvm/include/llvm/ADT/PointerUnion.h:56:10: error: enumeral mismatch in conditional expression: ‘llvm::PointerLikeTypeTraits<llvm::PointerUnion<clang::Stmt*, const clang::Type*> >::<anonymous enum>’ vs ‘llvm::PointerLikeTypeTraits<clang::ObjCInterfaceDecl*>::<anonymous enum>’ [-Werror]
cc1plus: all warnings being treated as errors
make: *** [out/host/linux-x86/obj/EXECUTABLES/llvm-rs-cc_intermediates/slang_rs.o] Error 1

Fix:
vi frameworks/compile/slang/Android.mk

Remove ‘-Werror‘ from line 22:
local_cflags_for_slang := -Wno-sign-promo -Wall -Wno-unused-parameter

################## Fix 9 ##########################

Error:
frameworks/base/libs/rs/rsFont.cpp:224:76:   required from here

frameworks/base/include/utils/KeyedVector.h:193:31: error: ‘indexOfKey’ was not declared in this scope, and no declarations were found by argument-dependent lookup at the point of instantiation [-fpermissive]

frameworks/base/include/utils/KeyedVector.h:193:31: note: declarations in dependent base ‘android::KeyedVector<unsigned int, android::renderscript::Font::CachedGlyphInfo*>’ are not found by unqualified lookup

frameworks/base/include/utils/KeyedVector.h:193:31: note: use ‘this->indexOfKey’ instead

make: *** [out/host/linux-x86/obj/STATIC_LIBRARIES/libRS_intermediates/rsFont.o] Error 1

Fix:
vi frameworks/base/libs/rs/Android.mk

Add ‘-fpermissive‘ to line 183
LOCAL_CFLAGS += -Werror -Wall -Wno-unused-parameter -Wno-unused-variable -fpermissive

################## Fix 10 #########################

Error:
external/mesa3d/src/glsl/linker.cpp:1394:49: error: expected primary-expression before ‘,’ token
......
external/mesa3d/src/glsl/linker.cpp:1734:59: error: ‘offsetof’ was not declared in this scope
make: *** [out/host/linux-x86/obj/STATIC_LIBRARIES/libMesa_intermediates/src/glsl/linker.o] Error 1

Fix:
vi external/mesa3d/src/glsl/linker.cpp

Add ‘#include <stddef.h>‘ to list of includes as shown: 
#include <climits>
#include <stddef.h>
#include <pixelflinger2/pixelflinger2_interface.h>

################## Fix 11 #########################

Error:
external/gtest/src/../include/gtest/gtest-param-test.h:287:58: note: ‘template<class Container> testing::internal::ParamGenerator<typename Container::value_type> testing::ValuesIn(const Container&)’ declared here, later in the translation unit
make: *** [out/host/linux-x86/obj/STATIC_LIBRARIES/libgtest_host_intermediates/gtest-all.o] Error 1

Two fixes required:
1)
vi external/gtest/src/Android.mk

Add ‘-fpermissive‘ to lines 52 and 70 (both lines contain same info)
LOCAL_CFLAGS += -O0 -fpermissive

2)
vi external/gtest/include/gtest/internal/gtest-param-util.h

Add ‘#include <stddef.h>‘ to list of includes as shown:
#include <vector>
#include <cstddef>
#include <gtest/internal/gtest-port.h>

################## Fix 12 #########################

Error:

host Executable: test-librsloader (out/host/linux-x86/obj/EXECUTABLES/test-librsloader_intermediates/test-librsloader)
out/host/linux-x86/obj/STATIC_LIBRARIES/libLLVMSupport_intermediates/libLLVMSupport.a(Signals.o):在函数‘PrintStackTrace’中:
/home/crow/works/Android_src/external/llvm/lib/Support/Unix/Signals.inc:219:对‘dladdr’未定义的引用
/home/crow/works/Android_src/external/llvm/lib/Support/Unix/Signals.inc:231:对‘dladdr’未定义的引用
out/host/linux-x86/obj/STATIC_LIBRARIES/libLLVMSupport_intermediates/libLLVMSupport.a(Threading.o):在函数‘llvm::llvm_execute_on_thread(void (*)(void*), void*, unsigned int)’中:
/home/crow/works/Android_src/external/llvm/lib/Support/Threading.cpp:96:对‘pthread_create’未定义的引用
/home/crow/works/Android_src/external/llvm/lib/Support/Threading.cpp:100:对‘pthread_join’未定义的引用
/home/crow/works/Android_src/external/llvm/lib/Support/Threading.cpp:91:对‘pthread_attr_setstacksize’未定义的引用
out/host/linux-x86/obj/STATIC_LIBRARIES/libLLVMSupport_intermediates/libLLVMSupport.a(Mutex.o):在函数‘llvm::sys::MutexImpl::MutexImpl(bool)’中:
/home/crow/works/Android_src/external/llvm/lib/Support/Mutex.cpp:69:对‘pthread_mutexattr_init’未定义的引用
/home/crow/works/Android_src/external/llvm/lib/Support/Mutex.cpp:75:对‘pthread_mutexattr_settype’未定义的引用
/home/crow/works/Android_src/external/llvm/lib/Support/Mutex.cpp:80:对‘pthread_mutexattr_setpshared’未定义的引用
/home/crow/works/Android_src/external/llvm/lib/Support/Mutex.cpp:89:对‘pthread_mutexattr_destroy’未定义的引用
out/host/linux-x86/obj/STATIC_LIBRARIES/libLLVMSupport_intermediates/libLLVMSupport.a(Mutex.o):在函数‘llvm::sys::MutexImpl::tryacquire()’中:
/home/crow/works/Android_src/external/llvm/lib/Support/Mutex.cpp:143:对‘pthread_mutex_trylock’未定义的引用
collect2: 错误: ld 返回 1
make: *** [out/host/linux-x86/obj/EXECUTABLES/test-librsloader_intermediates/test-librsloader] 错误 1

Fix:

$vi external/llvm/llvm-host-build.mk +
LOCAL_LDLIBS := -lpthread -ldl

以上内容来自: http://blog.csdn.net/kangear/article/details/9565889

感谢作者分享.

out/host/linux-x86/obj/SHARED_LIBRARIES/libdvm_intermediates/native/dalvik_system_Zygote.o

Fix:

在dalvik/vm/native/dalvik_system_Zygote.cpp增加一个头文件定义#include <sys/resource.h>

-----------------------------------------------------------------------------------------------------------------------------

<command-line>:0:0: error: "_FORTIFY_SOURCE" redefined [-Werror]
frameworks/base/tools/obbtool/Main.cpp:1:0: note: this is the location of the previous definition
/*
^
cc1plus: all warnings being treated as errors
make: *** [out/host/linux-x86/obj/EXECUTABLES/obbtool_intermediates/Main.o] Error 1

Fix:

修改源码目录下/build/core/combo/HOST_linux-x86.mk文件:

将以下语句

HOST_GLOBAL_CFLAGS += -D_FORTIFY_SOURCE=0

修改为

HOST_GLOBAL_CFLAGS += -U_FORTIFY_SOURCE -D_FORTIFY_SOURCE=0

  

时间: 10-13

linux mint 17编译android 2.3.1错误记录的相关文章

Linux Mint 17一周使用体验

1 Win7下安装Mint双系统 Linux Mint支持直接从Win7硬盘引导安装,非常方便,不用制作U盘引导,更不用刻盘安装了.Mint有Cinnamon和Mate两种桌面,听说Mate更加简洁节省资源,所以就选择了Linux Mint 17 Mate版.安装过程主要参考百度经验. 1.1 清理磁盘空间 为Mint清理出空间.例如我的机器之前有C.D.E.F四个盘符,备份好E和F盘中的重要数据后,右键"我的电脑"=>"管理"=>"磁盘管理&

Linux Mint 17 + 小米WIFI创建手机热点

转载:http://www.pppei.net/blog/post/690 亲测可行! 我的系统是linux mint 17.1 64位,所用wifi位小米WIFI. 以下是原文: 此方法在linuxmint 17.1下测试通过.理论上可支持小米wifi.360wifi. 具体操作如下: 1.下载安装MT7601U驱动MT7601U驱动提取密码:2r8h这里感谢下 http://bbs.xiaomi.cn/thread-10160085-1-1.html 帖子的作者. 将下载的驱动解压,进入解压

安装Linux Mint 17后要做的20件事

安装Linux Mint 17后要做的20件事 Linux Mint 17 Qiana Cinnamon Linux Mint 17已经发布,定名为Qiana.Mint是Linux最佳发行版之一,它定位于桌面用户,关注可用性和简洁.它携带了风格迥异的桌面环境,如Mate以及Cinnamon,并基于不同的发行版,如Ubuntu或Debian. 在本文中,我们使用的是Linux Mint 17的cinnamon版本.要获取更多关于Cinnamon版本的信息(包括下载链接),可以访问 - http:/

Linux mint 17中文输入法安装,改动linux mint与windows7双系统启动顺序

安装好linux mint17后,进入mint系统,首先须要一个比較合适的中文输入法. 一.首先迎来的就是安装中文输入法了,之前听说搜狗为ubuntu kinly定制了输入法,所以就想安装搜狗输入法,可是搜索了多个教程并不起作用,安装时缺少必要的依赖,作为菜鸟并没有去研究一番,没有去较劲,终于发现了没有必要安装那个,如今的fcitx-sunpinyin,也很好用,应该是为麒麟输入法做的,上面还有小麒麟的标志.安装方法例如以下: sudo add-apt-repository ppa:fcitx-

Linux Mint下编译Bochs

我在Linux Mint命令行下输入sudo apt-get install bochs安装之后发现这个没有安装gui界面,使用也存在一些问题,所以直接删掉从官网下载代码自己编译安装. 给Linux Mint添加合适的源 deb http://mirrors.163.com/ubuntu/ utopic main restricted universe multiverse deb http://mirrors.163.com/ubuntu/ utopic-security main restr

linux下反编译android apk

本人的系统为ubuntu12.04 1.所需要的工具 1)apktool,功能:反编译出apk所需要的资源文件和布局设置文件等, 下载地址:https://code.google.com/p/android-apktool/downloads/list 需要下载apktool1.5.2.tar.bz2 和apktool-install-linux-r05-ibot.tar.bz2 这两个文件,并把解压后的文件放在同一个文件夹中. 2)dex2jar,功能:反编译出jar文件,即apk的源程序文件

配置pyqt5环境 for python3.4 on Linux Mint 17.1

1.安装QT 配置QT PATH 在 /etc/profile文件中追加 export QTDIR=/usr/local/Qt5.4.2/5.4/gcc_64 export LD_LIBRARY_PATH=${LD_LIBRARY_PATH}:${QTDIR}/lib export PATH=${QTDIR}/bin:${PATH} 注意${QTDIR}/bin和${PATH}的顺序!因为Ubuntu14.04默认${PATH}路径中的/usr/bin下存在诸多qt命令(确切的说是指向qtcho

Linux Mint 17 亮度 和 搜狗输入法

调亮度: 1 echo 100 > /sys/class/backlight/intel_backlight/brightness #100是亮度值,比较低,根据自己需要调,如200 安装搜狗拼音: 1.下载 2. 解包安装  1 sudo dpkg -i 搜狗拼音包名(放在主目录下).deb 3.修复 1 sudo apt-get install fcitx-module-kimpanel #安装失败之后按照提示输入命令即可,好像是sudo apt-get -f install命令 4.重启哦

【转】在Ubuntu下编译Android源码并运行Emulator

原文网址:http://www.mcuos.com/thread-4553-1-1.html 建立编译环境 1.在VirtualBox上安装Ubuntu 2.安装JDK   $ sudo apt-get install sun-java5-jdk  或   $ sudo apt-get install sun-java6-jdk (donut 1.6)3.安装flex,bison,gperf,libsdl-dev,libesd0-dev,libwxgtk2.6-dev(可选),build-ess